Reaction Details
TargetBile acid receptor
LigandBDBM225935
Substrate/Competitorn/a
Meas. Tech.Scintillation Proximity Assay (SPA)
pH7.4±n/a
IC50 20.500000±n/a nM
Commentsextracted
Citation D3R, DD Drug Design Data Resource Grand Challenge 2 Dataset: FXR - Farnesoid X Receptor D3R D3R Publication Date 4/13/2017
 
Bile acid receptor
Name:Bile acid receptor
Type:Nuclear Receptor
Mol. Mass.:55916.24
Organism:Homo sapiens (Human)
Description:Q96RI1
Residue:486
BDBM225935
NameBDBM225935
Synonyms:FXR_24
TypeSmall Organic Molecule
Emp. Form.C27H23ClF3N3O
Mol. Mass.497.939
SMILESFc1ccccc1NC(=O)[C@H](C1CCCCC1)n1c(nc2cc(F)c(F)cc12)-c1ccc(Cl)cc1