Reaction Details
TargetBile acid receptor
LigandBDBM225944
Substrate/Competitorn/a
Meas. Tech.Scintillation Proximity Assay (SPA)
pH7.4±n/a
IC50 7.900000±n/a nM
Commentsextracted
Citation D3R, DD Drug Design Data Resource Grand Challenge 2 Dataset: FXR - Farnesoid X Receptor D3R D3R Publication Date 4/13/2017
 
Bile acid receptor
Name:Bile acid receptor
Type:Nuclear Receptor
Mol. Mass.:55916.24
Organism:Homo sapiens (Human)
Description:Q96RI1
Residue:486
BDBM225944
NameBDBM225944
Synonyms:FXR_34
TypeSmall Organic Molecule
Emp. Form.C32H45NO6
Mol. Mass.539.7028
SMILESC[C@H](CCC(=O)Nc1cc(cc(c1)C(O)=O)C(O)=O)[C@H]1CC[C@H]2[C@@H]3CC[C@@H]4C[C@H](O)CC[C@]4(C)[C@H]3CC[C@]12C