Reaction Details
TargetBile acid receptor
LigandBDBM225945
Substrate/Competitorn/a
Meas. Tech.Scintillation Proximity Assay (SPA)
pH7.4±n/a
IC50 175±n/a nM
Commentsextracted
Citation D3R, DD Drug Design Data Resource Grand Challenge 2 Dataset: FXR - Farnesoid X Receptor D3R D3R Publication Date 4/13/2017
 
Bile acid receptor
Name:Bile acid receptor
Type:Nuclear Receptor
Mol. Mass.:55916.24
Organism:Homo sapiens (Human)
Description:Q96RI1
Residue:486
BDBM225945
NameBDBM225945
Synonyms:FXR_35
TypeSmall Organic Molecule
Emp. Form.C27H30ClF2N3O5S
Mol. Mass.582.059
SMILESOS(=O)(=O)O[C@H]1CC[C@@H](CC1)NC(=O)[C@H](C1CCCCC1)n1c(nc2cc(F)c(F)cc12)-c1ccc(Cl)cc1