Reaction Details
TargetBile acid receptor
LigandBDBM225949
Substrate/Competitorn/a
Meas. Tech.Scintillation Proximity Assay (SPA)
pH7.4±n/a
IC50 114±n/a nM
Commentsextracted
Citation D3R, DD Drug Design Data Resource Grand Challenge 2 Dataset: FXR - Farnesoid X Receptor D3R D3R Publication Date 4/13/2017
 
Bile acid receptor
Name:Bile acid receptor
Type:Nuclear Receptor
Mol. Mass.:55916.24
Organism:Homo sapiens (Human)
Description:Q96RI1
Residue:486
BDBM225949
NameBDBM225949
Synonyms:FXR_39
TypeSmall Organic Molecule
Emp. Form.C29H37N3O
Mol. Mass.443.6236
SMILESCCc1ccc(cc1)-c1nc2ccccc2n1[C@@H](C1CCCCC1)C(=O)NC1CCCCC1