Reaction Details
TargetBile acid receptor
LigandBDBM225959
Substrate/Competitorn/a
Meas. Tech.Scintillation Proximity Assay (SPA)
pH7.4±n/a
IC50>100000±n/a nM
Commentsextracted
Citation D3R, DD Drug Design Data Resource Grand Challenge 2 Dataset: FXR - Farnesoid X Receptor D3R D3R Publication Date 4/13/2017
 
Bile acid receptor
Name:Bile acid receptor
Type:Nuclear Receptor
Mol. Mass.:55916.24
Organism:Homo sapiens (Human)
Description:Q96RI1
Residue:486
BDBM225959
NameBDBM225959
Synonyms:FXR_49
TypeSmall Organic Molecule
Emp. Form.C25H22N4O4S2
Mol. Mass.506.597
SMILESCC(=O)c1ccc(NC(=O)c2c3CN(CCc3nn2-c2ccccc2)S(=O)(=O)c2cccs2)cc1