Reaction Details
TargetBile acid receptor
LigandBDBM50336388
Substrate/Competitorn/a
Meas. Tech.Scintillation Proximity Assay (SPA)
pH7.4±n/a
IC50 315±n/a nM
Commentsextracted
Citation D3R, DD Drug Design Data Resource Grand Challenge 2 Dataset: FXR - Farnesoid X Receptor D3R D3R Publication Date 4/13/2017
 
Bile acid receptor
Name:Bile acid receptor
Type:Nuclear Receptor
Mol. Mass.:55916.24
Organism:Homo sapiens (Human)
Description:Q96RI1
Residue:486
BDBM50336388
NameBDBM50336388
Synonyms:CHEMBL1668261 trans-4-((2S)-2-cyclohexyl-2-(2-(2,4-dimethoxypyridin-3-yl)-5,6-difluoro-1H-benzo[d]imidazol-1-yl)acetamido)cyclohexanecarboxylic acid
TypeSmall organic molecule
Emp. Form.C29H34F2N4O5
Mol. Mass.556.6009
SMILESCOc1ccc(-c2nc3cc(F)c(F)cc3n2[C@@H](C2CCCCC2)C(=O)N[C@H]2CC[C@@H](CC2)C(O)=O)c(OC)n1