Reaction Details
TargetBile acid receptor
LigandBDBM225972
Substrate/Competitorn/a
Meas. Tech.Scintillation Proximity Assay (SPA)
pH7.4±n/a
IC50 94±n/a nM
Commentsextracted
Citation D3R, DD Drug Design Data Resource Grand Challenge 2 Dataset: FXR - Farnesoid X Receptor D3R D3R Publication Date 4/13/2017
 
Bile acid receptor
Name:Bile acid receptor
Type:Nuclear Receptor
Mol. Mass.:55916.24
Organism:Homo sapiens (Human)
Description:Q96RI1
Residue:486
BDBM225972
NameBDBM225972
Synonyms:FXR_65
TypeSmall Organic Molecule
Emp. Form.C29H25Cl2N3O4
Mol. Mass.550.433
SMILESCC(C)c1onc(c1COc1ccc(c(C)c1)-c1ccc2c(cn(C)c2c1)C(O)=O)-c1c(Cl)cncc1Cl