Reaction Details
TargetBile acid receptor
LigandBDBM225980
Substrate/Competitorn/a
Meas. Tech.Scintillation Proximity Assay (SPA)
pH7.4±n/a
IC50 11200±n/a nM
Commentsextracted
Citation D3R, DD Drug Design Data Resource Grand Challenge 2 Dataset: FXR - Farnesoid X Receptor D3R D3R Publication Date 4/13/2017
 
Bile acid receptor
Name:Bile acid receptor
Type:Nuclear Receptor
Mol. Mass.:55916.24
Organism:Homo sapiens (Human)
Description:Q96RI1
Residue:486
BDBM225980
NameBDBM225980
Synonyms:FXR_73
TypeSmall Organic Molecule
Emp. Form.C23H21BrN2O4S2
Mol. Mass.533.458
SMILESOc1ccc(CN2C(=O)C3(CCN(CC3)S(=O)(=O)c3cccs3)c3cc(Br)ccc23)cc1