Reaction Details
TargetBile acid receptor
LigandBDBM225983
Substrate/Competitorn/a
Meas. Tech.Scintillation Proximity Assay (SPA)
pH7.4±n/a
IC50 41800±n/a nM
Commentsextracted
Citation D3R, DD Drug Design Data Resource Grand Challenge 2 Dataset: FXR - Farnesoid X Receptor D3R D3R Publication Date 4/13/2017
 
Bile acid receptor
Name:Bile acid receptor
Type:Nuclear Receptor
Mol. Mass.:55916.24
Organism:Homo sapiens (Human)
Description:Q96RI1
Residue:486
BDBM225983
NameBDBM225983
Synonyms:FXR_76
TypeSmall Organic Molecule
Emp. Form.C26H23BrN2O5S
Mol. Mass.555.44
SMILESOC(=O)c1ccc(CN2C(=O)C3(CCN(CC3)S(=O)(=O)c3ccccc3)c3cc(Br)ccc23)cc1