Reaction Details
TargetCoagulation factor X
LigandBDBM12568
Substrate/Competitorn/a
Meas. Tech.D3R246
IC50 4.41±n/a nM
Citation D3R, DD GSK FactorXA-2 D3R D3R Publication Date 7/29/2015
 
Coagulation factor X
Name:Coagulation factor X
Type:Enzyme
Mol. Mass.:54726.60
Organism:Homo sapiens (Human)
Description:n/a
Residue:488
BDBM12568
NameBDBM12568
Synonyms:2-[(6-chloronaphthalene-2-)[(3S)-1-[(2S)-1-(morpholin-4-yl)-1-oxopropan-2-yl]-2-oxopyrrolidin-3-yl]sulfonamido]acetamide pyrrolidin-2-one-based inhibitor 27
TypeSmall organic molecule
Emp. Form.C23H27ClN4O6S
Mol. Mass.523.002
SMILESC[C@H](N1CC[C@H](N(CC(N)=O)S(=O)(=O)c2ccc3cc(Cl)ccc3c2)C1=O)C(=O)N1CCOCC1