Reaction Details
TargetCoagulation factor X
LigandBDBM50306148
Substrate/Competitorn/a
Meas. Tech.D3R246
IC50 4.83±n/a nM
Citation D3R, DD GSK FactorXA-2 D3R D3R Publication Date 7/29/2015
 
Coagulation factor X
Name:Coagulation factor X
Type:Enzyme
Mol. Mass.:54726.60
Organism:Homo sapiens (Human)
Description:n/a
Residue:488
BDBM50306148
NameBDBM50306148
Synonyms:(S)-4-(3-(2-(5-chlorothiophen-2-yl)vinylsulfonamido)-2-oxopyrrolidin-1-yl)-3-fluoro-N,N-dimethylbenzamide GTC000101A
TypeSmall organic molecule
Emp. Form.C19H19ClFN3O4S2
Mol. Mass.471.953
SMILESCN(C)C(=O)c1ccc(N2CC[C@H](NS(=O)(=O)\C=C\c3ccc(Cl)s3)C2=O)c(F)c1