Reaction Details
TargetTyrosine-protein phosphatase non-receptor type 1
LigandBDBM226155
Substrate/Competitorp-Nitrophenyl phosphate (p-NPP)
Meas. Tech.PTP1B Assay
pH6±0
Temperature310.15±0 K
Ki 1.11e+4± 2e+2 nM
IC50 1.46e+4± 1e+2 nM
Citation Le, DDNguyen, DHZhao, BTSeong, SHChoi, JSKim, SKKim, JAMin, BSWoo, MH PTP1B inhibitors from Selaginella tamariscina (Beauv.) Spring and their kinetic properties and molecular docking simulation Bioorg Chem72:273-281 (2017)  
 
Tyrosine-protein phosphatase non-receptor type 1
Name:Tyrosine-protein phosphatase non-receptor type 1
Type:Protein phosphatase
Mol. Mass.:49963.76
Organism:Homo sapiens (Human)
Description:Human recombinant GST-fusion PTP1B (1-435).
Residue:435
BDBM226155
p-Nitrophenyl phosphate (p-NPP)
NameBDBM226155
Synonyms:Selaginellin W (4)
TypeSmall organic molecule
Emp. Form.C33H22O5
Mol. Mass.498.5248
SMILES[#8]-c1ccc(cc1)C#Cc1cccc(-c2ccc(-[#8])cc2-[#8])c1\[#6](=[#6]-1/[#6]=[#6]-[#6](=O)-[#6]=[#6]-1)-c1ccc(-[#8])cc1