Reaction Details
TargetTyrosine-protein phosphatase non-receptor type 1
LigandBDBM50093523
Substrate/Competitorp-Nitrophenyl phosphate (p-NPP)
Meas. Tech.PTP1B Assay
pH6±0
Temperature310.15±0 K
Ki 1.45e+4± 7e+2 nM
IC50 1.32e+4± 8e+2 nM
Citation Le, DDNguyen, DHZhao, BTSeong, SHChoi, JSKim, SKKim, JAMin, BSWoo, MH PTP1B inhibitors from Selaginella tamariscina (Beauv.) Spring and their kinetic properties and molecular docking simulation Bioorg Chem72:273-281 (2017)  
 
Tyrosine-protein phosphatase non-receptor type 1
Name:Tyrosine-protein phosphatase non-receptor type 1
Type:Protein phosphatase
Mol. Mass.:49963.76
Organism:Homo sapiens (Human)
Description:Human recombinant GST-fusion PTP1B (1-435).
Residue:435
BDBM50093523
p-Nitrophenyl phosphate (p-NPP)
NameBDBM50093523
Synonyms:CHEMBL3585679 | PTP1B spring 6 (6)
TypeSmall organic molecule
Emp. Form.C22H16O5
Mol. Mass.360.3594
SMILESOCc1ccc(-c2ccc(O)cc2)c(C(O)=O)c1C#Cc1ccc(O)cc1