Reaction Details
TargetTyrosine-protein phosphatase non-receptor type 1
LigandBDBM226157
Substrate/Competitorp-Nitrophenyl phosphate (p-NPP)
Meas. Tech.PTP1B Assay
pH6±0
Temperature310.15±0 K
Ki 3.0e+3± 2e+2 nM
IC50 4.8e+3± 1e+2 nM
Citation Le, DDNguyen, DHZhao, BTSeong, SHChoi, JSKim, SKKim, JAMin, BSWoo, MH PTP1B inhibitors from Selaginella tamariscina (Beauv.) Spring and their kinetic properties and molecular docking simulation Bioorg Chem72:273-281 (2017)  
 
Tyrosine-protein phosphatase non-receptor type 1
Name:Tyrosine-protein phosphatase non-receptor type 1
Type:Protein phosphatase
Mol. Mass.:49963.76
Organism:Homo sapiens (Human)
Description:Human recombinant GST-fusion PTP1B (1-435).
Residue:435
BDBM226157
p-Nitrophenyl phosphate (p-NPP)
NameBDBM226157
Synonyms:PTP1B spring 7 (7)
TypeSmall organic molecule
Emp. Form.C34H26O5
Mol. Mass.514.5672
SMILESCOc1ccc(-c2ccc(O)cc2)c(C(c2ccc(O)cc2)c2ccc(O)cc2)c1C#Cc1ccc(O)cc1