Reaction Details
TargetTyrosine-protein phosphatase non-receptor type 1
LigandBDBM226182
Substrate/Competitorn/a
Meas. Tech.PTP1B Inhibitory Assay
pH6±n/a
IC50 60700±960 nM
Commentsextracted
Citation Nguyen, DHSeo, UMZhao, BTLe, DDSeong, SHChoi, JSMin, BSWoo, MH Ellagitannin and flavonoid constituents from Agrimonia pilosa Ledeb. with their protein tyrosine phosphatase and acetylcholinesterase inhibitory activities Bioorg Chem72:293-300 (2017)  
 
Tyrosine-protein phosphatase non-receptor type 1
Name:Tyrosine-protein phosphatase non-receptor type 1
Type:Protein phosphatase
Mol. Mass.:49963.76
Organism:Homo sapiens (Human)
Description:Human recombinant GST-fusion PTP1B (1-435).
Residue:435
BDBM226182
NameBDBM226182
Synonyms:Kaempferol 3-O-β-D-glucoside (6)
TypeSmall organic molecule
Emp. Form.C21H20O11
Mol. Mass.448.3769
SMILESOC[C@H]1O[C@@H](Oc2c(oc3cc(O)cc(O)c3c2=O)-c2ccc(O)cc2)[C@H](O)[C@@H](O)[C@@H]1O