Reaction Details
TargetAcetylcholinesterase
LigandBDBM226180
Substrate/Competitorn/a
Meas. Tech.Acetylcholinesterase Inhibitory Assay
pH8±n/a
Temperature298.15±n/a K
IC50 63940±270 nM
Commentsextracted
Citation Nguyen, DHSeo, UMZhao, BTLe, DDSeong, SHChoi, JSMin, BSWoo, MH Ellagitannin and flavonoid constituents from Agrimonia pilosa Ledeb. with their protein tyrosine phosphatase and acetylcholinesterase inhibitory activities Bioorg Chem72:293-300 (2017)  
 
Acetylcholinesterase
Name:Acetylcholinesterase
Type:Enzyme
Mol. Mass.:67792.70
Organism:Homo sapiens (Human)
Description:P22303
Residue:614
BDBM226180
NameBDBM226180
Synonyms:Kaempferol 7-O-β-D-glucoside (4)
TypeSmall organic molecule
Emp. Form.C21H20O11
Mol. Mass.448.3769
SMILESOC[C@H]1O[C@@H](Oc2cc(O)c3c(c2)oc(-c2ccc(O)cc2)c(O)c3=O)[C@H](O)[C@@H](O)[C@@H]1O