Reaction Details
TargetAcetylcholinesterase
LigandBDBM226188
Substrate/Competitorn/a
Meas. Tech.Acetylcholinesterase Inhibitory Assay
pH8±n/a
Temperature298.15±n/a K
IC50 92850±1120 nM
Commentsextracted
Citation Nguyen, DHSeo, UMZhao, BTLe, DDSeong, SHChoi, JSMin, BSWoo, MH Ellagitannin and flavonoid constituents from Agrimonia pilosa Ledeb. with their protein tyrosine phosphatase and acetylcholinesterase inhibitory activities Bioorg Chem72:293-300 (2017)  
 
Acetylcholinesterase
Name:Acetylcholinesterase
Type:Enzyme
Mol. Mass.:67792.70
Organism:Homo sapiens (Human)
Description:P22303
Residue:614
BDBM226188
NameBDBM226188
Synonyms:dihydrodehydrodiconifeyl alcohol 9'-O-β-D-glucose (19)
TypeSmall organic molecule
Emp. Form.C26H34O11
Mol. Mass.522.5416
SMILESCOc1cc(CCCO)cc2C(CO)C(Oc12)c1ccc(O[C@@H]2OC(CO)[C@@H](O)C(O)[C@@H]2O)c(OC)c1