Reaction Details
TargetHigh affinity nerve growth factor receptor [441-796]
LigandBDBM226353
Substrate/Competitorn/a
Meas. Tech.Cell Based Assay
Temperature310.15±n/a K
IC50 1.806±n/a nM
Commentsextracted
Citation Bagal, SKCui, JJGreasley, SELunney, EAMcAlpine, IJNagata, ANinkovic, SOmoto, KSkerratt, SEStorer, RIWarmus, JS Tropomyosin-related kinase inhibitors US Patent US9328096 Publication Date 5/3/2016
 
High affinity nerve growth factor receptor [441-796]
Name:High affinity nerve growth factor receptor [441-796]
Type:Protein
Mol. Mass.:39939.20
Organism:Homo sapiens (Human)
Description:Human his-tagged TrkA cytoplasmic domain (441-796 aa)
Residue:356
BDBM226353
NameBDBM226353
Synonyms:US9328096, 46
TypeSmall organic molecule
Emp. Form.C26H19Cl2N7O2
Mol. Mass.532.381
SMILESClc1cc(Cl)c(cc1C(=O)Nc1cc(nn1-c1ccccc1)C(=O)NCc1cn[nH]c1)-c1ccccn1