Reaction Details
TargetHigh affinity nerve growth factor receptor [441-796]
LigandBDBM226845
Substrate/Competitorn/a
Meas. Tech.Cell Based Assay
Temperature310.15±n/a K
IC50 4.46±n/a nM
Commentsextracted
Citation Bagal, SKCui, JJGreasley, SELunney, EAMcAlpine, IJNagata, ANinkovic, SOmoto, KSkerratt, SEStorer, RIWarmus, JS Tropomyosin-related kinase inhibitors US Patent US9328096 Publication Date 5/3/2016
 
High affinity nerve growth factor receptor [441-796]
Name:High affinity nerve growth factor receptor [441-796]
Type:Protein
Mol. Mass.:39939.20
Organism:Homo sapiens (Human)
Description:Human his-tagged TrkA cytoplasmic domain (441-796 aa)
Residue:356
BDBM226845
NameBDBM226845
Synonyms:US9328096, 538
TypeSmall organic molecule
Emp. Form.C28H24Cl2FN5O3
Mol. Mass.568.426
SMILESO[C@H]1CC[C@H](CC1)NC(=O)c1cc(NC(=O)c2cc(c(Cl)cc2Cl)-c2ncccc2F)n(n1)-c1ccccc1