Reaction Details
TargetHigh affinity nerve growth factor receptor [441-796]
LigandBDBM226866
Substrate/Competitorn/a
Meas. Tech.Cell Based Assay
Temperature310.15±n/a K
IC50 4.68±n/a nM
Commentsextracted
Citation Bagal, SKCui, JJGreasley, SELunney, EAMcAlpine, IJNagata, ANinkovic, SOmoto, KSkerratt, SEStorer, RIWarmus, JS Tropomyosin-related kinase inhibitors US Patent US9328096 Publication Date 5/3/2016
 
High affinity nerve growth factor receptor [441-796]
Name:High affinity nerve growth factor receptor [441-796]
Type:Protein
Mol. Mass.:39939.20
Organism:Homo sapiens (Human)
Description:Human his-tagged TrkA cytoplasmic domain (441-796 aa)
Residue:356
BDBM226866
NameBDBM226866
Synonyms:US9328096, 559
TypeSmall organic molecule
Emp. Form.C27H18Cl2FN7O2
Mol. Mass.562.382
SMILESFc1cccnc1-c1cc(C(=O)Nc2cc(nn2-c2ccccc2)C(=O)NCc2ccncn2)c(Cl)cc1Cl