Reaction Details
TargetHigh affinity nerve growth factor receptor [441-796]
LigandBDBM226881
Substrate/Competitorn/a
Meas. Tech.Cell Based Assay
Temperature310.15±n/a K
IC50 2.46±n/a nM
Commentsextracted
Citation Bagal, SKCui, JJGreasley, SELunney, EAMcAlpine, IJNagata, ANinkovic, SOmoto, KSkerratt, SEStorer, RIWarmus, JS Tropomyosin-related kinase inhibitors US Patent US9328096 Publication Date 5/3/2016
 
High affinity nerve growth factor receptor [441-796]
Name:High affinity nerve growth factor receptor [441-796]
Type:Protein
Mol. Mass.:39939.20
Organism:Homo sapiens (Human)
Description:Human his-tagged TrkA cytoplasmic domain (441-796 aa)
Residue:356
BDBM226881
NameBDBM226881
Synonyms:US9328096, 574
TypeSmall organic molecule
Emp. Form.C26H17Cl2FN6O3
Mol. Mass.551.356
SMILESFc1cccnc1-c1cc(C(=O)Nc2cc(nn2-c2ccccc2)C(=O)NCc2ccno2)c(Cl)cc1Cl