Reaction Details
TargetHigh affinity nerve growth factor receptor [441-796]
LigandBDBM227148
Substrate/Competitorn/a
Meas. Tech.Cell Based Assay
Temperature310.15±n/a K
IC50 1.04±n/a nM
Commentsextracted
Citation Bagal, SKCui, JJGreasley, SELunney, EAMcAlpine, IJNagata, ANinkovic, SOmoto, KSkerratt, SEStorer, RIWarmus, JS Tropomyosin-related kinase inhibitors US Patent US9328096 Publication Date 5/3/2016
 
High affinity nerve growth factor receptor [441-796]
Name:High affinity nerve growth factor receptor [441-796]
Type:Protein
Mol. Mass.:39939.20
Organism:Homo sapiens (Human)
Description:Human his-tagged TrkA cytoplasmic domain (441-796 aa)
Residue:356
BDBM227148
NameBDBM227148
Synonyms:US9328096, 836
TypeSmall organic molecule
Emp. Form.C28H20ClF2N7O2
Mol. Mass.559.954
SMILESNc1cc(CNC(=O)c2cc(NC(=O)c3cc(c(F)cc3Cl)-c3ncccc3F)n(n2)-c2ccccc2)ccn1