Reaction Details
TargetSerine/threonine-protein kinase pim-1
LigandBDBM227160
Substrate/Competitorn/a
Meas. Tech.PIM Kinase Binding Assay
pH7.2±n/a
Temperature298.15±n/a K
Ki 0.008±n/a nM
Commentsextracted
Citation Burch, JSun, MWang, XBlackaby, WHodges, AJSharpe, A Cyclic ether pyrazol-4-yl-heterocyclyl-carboxamide compounds and methods of use US Patent US9328106 Publication Date 5/3/2016
 
Serine/threonine-protein kinase pim-1
Name:Serine/threonine-protein kinase pim-1
Type:Protein
Mol. Mass.:35681.82
Organism:Homo sapiens (Human)
Description:P11309
Residue:313
BDBM227160
NameBDBM227160
Synonyms:US9328106, 107
TypeSmall organic molecule
Emp. Form.C21H22F2N6O2S
Mol. Mass.460.5
SMILESCn1ncc(NC(=O)c2nc(sc2N)-c2c(F)cccc2F)c1C12CCC(O1)C(N)CC2