Reaction Details
TargetHistone-lysine N-methyltransferase EZH2
LigandBDBM227458
Substrate/Competitorn/a
Meas. Tech.Inhibition Assay
pH7.6±n/a
IC50 4100±n/a nM
Commentsextracted
Citation Copeland, RARichon, VMScott, MDSneeringer, CJKuntz, KWKnutson, SKPollock, RM Inhibitors of human EZH2, and methods of use thereof US Patent US9333217 Publication Date 5/10/2016
 
Histone-lysine N-methyltransferase EZH2
Name:Histone-lysine N-methyltransferase EZH2
Type:Protein
Mol. Mass.:85367.84
Organism:Homo sapiens (Human)
Description:Q15910
Residue:746
BDBM227458
NameBDBM227458
Synonyms:US9333217, 75
TypeSmall organic molecule
Emp. Form.C24H33ClN8O5
Mol. Mass.549.022
SMILESN[C@@H](CCN(CCNCCc1ccc(Cl)cc1)CC1O[C@H]([C@H](O)[C@@H]1O)n1cnc2c(N)ncnc12)C(O)=O