Reaction Details
TargetTyrosine-protein kinase SYK [360-635]
LigandBDBM227514
Substrate/Competitorn/a
Meas. Tech.SYK Kinase Assay
Temperature303.15±n/a K
IC50 21.1±n/a nM
Commentsextracted
Citation Hermann, JCKennedy-Smith, JLucas, MCPadilla, FSchoenfeld, RCWovkulich, PM Pyrrolo[2,3-B]pyrazines as SYK inhibitors US Patent US9334278 Publication Date 5/10/2016
 
Tyrosine-protein kinase SYK [360-635]
Name:Tyrosine-protein kinase SYK [360-635]
Type:n/a
Mol. Mass.:31987.15
Organism:Homo sapiens (Human)
Description:Human MetAP2 protein from a culture superatant of insect cells (sf9) infected with MetAP2 recombinant baculovirus
Residue:276
BDBM227514
NameBDBM227514
Synonyms:US9334278, I-3
TypeSmall organic molecule
Emp. Form.C15H19N7O
Mol. Mass.313.3577
SMILESCn1ccc(Nc2cnc3[nH]cc(C(=O)NC(C)(C)C)c3n2)n1