Reaction Details
TargetTyrosine-protein kinase SYK [360-635]
LigandBDBM227522
Substrate/Competitorn/a
Meas. Tech.SYK Kinase Assay
Temperature303.15±n/a K
IC50 10.9±n/a nM
Commentsextracted
Citation Hermann, JCKennedy-Smith, JLucas, MCPadilla, FSchoenfeld, RCWovkulich, PM Pyrrolo[2,3-B]pyrazines as SYK inhibitors US Patent US9334278 Publication Date 5/10/2016
 
Tyrosine-protein kinase SYK [360-635]
Name:Tyrosine-protein kinase SYK [360-635]
Type:n/a
Mol. Mass.:31987.15
Organism:Homo sapiens (Human)
Description:Human MetAP2 protein from a culture superatant of insect cells (sf9) infected with MetAP2 recombinant baculovirus
Residue:276
BDBM227522
NameBDBM227522
Synonyms:US9334278, I-11
TypeSmall organic molecule
Emp. Form.C18H20FN5O
Mol. Mass.341.3827
SMILESCc1ccc(Nc2cnc3[nH]cc(C(=O)NC(C)(C)C)c3n2)c(F)c1