Reaction Details
TargetTyrosine-protein kinase SYK [360-635]
LigandBDBM227533
Substrate/Competitorn/a
Meas. Tech.SYK Kinase Assay
Temperature303.15±n/a K
IC50 25.1±n/a nM
Commentsextracted
Citation Hermann, JCKennedy-Smith, JLucas, MCPadilla, FSchoenfeld, RCWovkulich, PM Pyrrolo[2,3-B]pyrazines as SYK inhibitors US Patent US9334278 Publication Date 5/10/2016
 
Tyrosine-protein kinase SYK [360-635]
Name:Tyrosine-protein kinase SYK [360-635]
Type:n/a
Mol. Mass.:31987.15
Organism:Homo sapiens (Human)
Description:Human MetAP2 protein from a culture superatant of insect cells (sf9) infected with MetAP2 recombinant baculovirus
Residue:276
BDBM227533
NameBDBM227533
Synonyms:US9334278, I-22
TypeSmall organic molecule
Emp. Form.C15H18N6O2
Mol. Mass.314.3424
SMILESCc1cc(Nc2cnc3[nH]cc(C(=O)NC(C)(C)C)c3n2)on1