Reaction Details
TargetCarboxylic ester hydrolase
LigandBDBM227583
Substrate/Competitorn/a
Meas. Tech.In Vitro AChE/BChE Inhibition Assay
pH7.4±n/a
Temperature298.15±n/a K
IC50 7.8±0.8 nM
Commentsextracted
Citation Czarnecka, KSzymanski, PGirek, MMikiciuk-Olasik, ESkibinski, RKabzinski, JMajsterek, IMalawska, BJonczyk, JBajda, M Tetrahydroacridine derivatives with fluorobenzoic acid moiety as multifunctional agents for Alzheimer's disease treatment. Bioorg Chem72:315-322 (2017) 
 
Carboxylic ester hydrolase
Name:Carboxylic ester hydrolase
Type:Protein
Mol. Mass.:68842.83
Organism:Equus caballus (Horse)
Description:Q9N1N9
Residue:602
BDBM227583
NameBDBM227583
Synonyms:2-Fluoro-N-[3-(1,2,3,4-tetrahydroacridin-9-ylamino)propyl]benzamide hydrochloride (3b)
TypeSmall organic molecule
Emp. Form.C23H24FN3O
Mol. Mass.377.4546
SMILESFc1ccccc1C(=O)NCCCNc1c2CCCCc2nc2ccccc12