Reaction Details
TargetPhosphatidylinositol 4,5-bisphosphate 3-kinase catalytic subunit delta isoform
LigandBDBM291355
Substrate/Competitorn/a
Meas. Tech.Biochemical Assay
IC50 6.00±n/a nM
Citation Shuttleworth, SJLiam Cecil, ARHill, TJSilva, FA Tricyclic heterocyclic compounds as phosphoinositide 3-kinase inhibitors US Patent US9580442 Publication Date 2/28/2017
 
Phosphatidylinositol 4,5-bisphosphate 3-kinase catalytic subunit delta isoform
Name:Phosphatidylinositol 4,5-bisphosphate 3-kinase catalytic subunit delta isoform
Type:Enzyme Subunit
Mol. Mass.:119489.41
Organism:Homo sapiens (Human)
Description:O00329
Residue:1044
BDBM291355
NameBDBM291355
Synonyms:2-(1H-Indol-4-yl)-4-morpholin-4-yl-pyrido[3′,2′:4,5]furo[3,2-d]pyrimidine US9938290, B
TypeSmall organic molecule
Emp. Form.C21H17N5O2
Mol. Mass.371.392
SMILESC1CN(CCO1)c1nc(nc2c3cccnc3oc12)-c1cccc2[nH]ccc12