Reaction Details
TargetPhosphatidylinositol 4,5-bisphosphate 3-kinase catalytic subunit beta isoform
LigandBDBM291356
Substrate/Competitorn/a
Meas. Tech.Biochemical Assay
IC50 57.0±n/a nM
Citation Shuttleworth, SJLiam Cecil, ARHill, TJSilva, FA Tricyclic heterocyclic compounds as phosphoinositide 3-kinase inhibitors US Patent US9580442 Publication Date 2/28/2017
 
Phosphatidylinositol 4,5-bisphosphate 3-kinase catalytic subunit beta isoform
Name:Phosphatidylinositol 4,5-bisphosphate 3-kinase catalytic subunit beta isoform
Type:Enzyme Subunit
Mol. Mass.:122769.00
Organism:Homo sapiens (Human)
Description:P42338
Residue:1070
BDBM291356
NameBDBM291356
Synonyms:4-Morpholin-4-yl-2-(1H-pyrrolo[2,3-b]pyridin-4-yl)-pyrido[3′,2′:4,5]furo[3,2-d]pyrimidine US9938290, D
TypeSmall organic molecule
Emp. Form.C20H16N6O2
Mol. Mass.372.38
SMILESC1CN(CCO1)c1nc(nc2c3cccnc3oc12)-c1ccnc2[nH]ccc12