Reaction Details
TargetPhosphatidylinositol 4,5-bisphosphate 3-kinase catalytic subunit delta isoform
LigandBDBM291362
Substrate/Competitorn/a
Meas. Tech.Biochemical Assay
IC50 26.0±n/a nM
Citation Shuttleworth, SJLiam Cecil, ARHill, TJSilva, FA Tricyclic heterocyclic compounds as phosphoinositide 3-kinase inhibitors US Patent US9580442 Publication Date 2/28/2017
 
Phosphatidylinositol 4,5-bisphosphate 3-kinase catalytic subunit delta isoform
Name:Phosphatidylinositol 4,5-bisphosphate 3-kinase catalytic subunit delta isoform
Type:Enzyme Subunit
Mol. Mass.:119489.41
Organism:Homo sapiens (Human)
Description:O00329
Residue:1044
BDBM291362
NameBDBM291362
Synonyms:2-(1H-Indol-4-yl)-8-(4-methyl-piperazin-1-ylmethyl)-4-morpholin-4-yl-pyrido[3′,2′:4,5]furo[3,2-d]pyrimidine US9938290, J
TypeSmall organic molecule
Emp. Form.C27H29N7O2
Mol. Mass.483.5649
SMILESCN1CCN(Cc2cnc3oc4c(nc(nc4c3c2)-c2cccc3[nH]ccc23)N2CCOCC2)CC1