Reaction Details
TargetPhosphatidylinositol 4,5-bisphosphate 3-kinase catalytic subunit beta isoform
LigandBDBM291363
Substrate/Competitorn/a
Meas. Tech.Biochemical Assay
IC50 64.0±n/a nM
Citation Shuttleworth, SJLiam Cecil, ARHill, TJSilva, FA Tricyclic heterocyclic compounds as phosphoinositide 3-kinase inhibitors US Patent US9580442 Publication Date 2/28/2017
 
Phosphatidylinositol 4,5-bisphosphate 3-kinase catalytic subunit beta isoform
Name:Phosphatidylinositol 4,5-bisphosphate 3-kinase catalytic subunit beta isoform
Type:Enzyme Subunit
Mol. Mass.:122769.00
Organism:Homo sapiens (Human)
Description:P42338
Residue:1070
BDBM291363
NameBDBM291363
Synonyms:2-(1H-Indol-4-yl)-4-morpholin-4-yl-8-morpholin-4-ylmethyl-pyrido[3′,2′:4,5]furo[3,2-d]pyrimidine US9938290, K
TypeSmall organic molecule
Emp. Form.C26H26N6O3
Mol. Mass.470.523
SMILESC(N1CCOCC1)c1cnc2oc3c(nc(nc3c2c1)-c1cccc2[nH]ccc12)N1CCOCC1