Reaction Details
TargetPhosphatidylinositol 4,5-bisphosphate 3-kinase catalytic subunit delta isoform
LigandBDBM291366
Substrate/Competitorn/a
Meas. Tech.Biochemical Assay
IC50 22.0±n/a nM
Citation Shuttleworth, SJLiam Cecil, ARHill, TJSilva, FA Tricyclic heterocyclic compounds as phosphoinositide 3-kinase inhibitors US Patent US9580442 Publication Date 2/28/2017
 
Phosphatidylinositol 4,5-bisphosphate 3-kinase catalytic subunit delta isoform
Name:Phosphatidylinositol 4,5-bisphosphate 3-kinase catalytic subunit delta isoform
Type:Enzyme Subunit
Mol. Mass.:119489.41
Organism:Homo sapiens (Human)
Description:O00329
Residue:1044
BDBM291366
NameBDBM291366
Synonyms:3-{4-[2-(1H-Indol-4-yl)-4-morpholin-4-yl-pyrido[3′,2′:4,5]furo[3,2-d]pyrimidin-8-ylmethyl]-piperazin-1-yl}-propionitrile US9938290, R
TypeSmall organic molecule
Emp. Form.C29H30N8O2
Mol. Mass.522.6009
SMILESN#CCCN1CCN(Cc2cnc3oc4c(nc(nc4c3c2)-c2cccc3[nH]ccc23)N2CCOCC2)CC1