Reaction Details
TargetOxidized purine nucleoside triphosphate hydrolase
LigandBDBM227632
Substrate/CompetitorBDBM227639
Meas. Tech.In Vitro MTH1 Enzymatic Assay
pH7.5±n/a
IC50 6.3e+2± 8e+1 nM
Commentsextracted
Citation Kumar, AKawamura, TKawatani, MOsada, HZhang, KYJ Identification and structure-activity relationship of purine derivatives as novel MTH1 inhibitors. Chem Biol Drug Des89:862-869 (2017) 
 
Oxidized purine nucleoside triphosphate hydrolase
Name:Oxidized purine nucleoside triphosphate hydrolase
Type:Protein
Mol. Mass.:22514.81
Organism:Homo sapiens (Human)
Description:P36639
Residue:197
BDBM227632
BDBM227639
NameBDBM227632
Synonyms:MTH1 inhibitor, 53
TypeSmall organic molecule
Emp. Form.C12H12N6
Mol. Mass.240.2639
SMILESNc1nc(NCc2ccccc2)c2nc[nH]c2n1