Reaction Details
TargetOxidized purine nucleoside triphosphate hydrolase
LigandBDBM227638
Substrate/CompetitorBDBM227639
Meas. Tech.In Vitro MTH1 Enzymatic Assay
pH7.5±n/a
IC50 2.3e+2± 2e+1 nM
Commentsextracted
Citation Kumar, AKawamura, TKawatani, MOsada, HZhang, KYJ Identification and structure-activity relationship of purine derivatives as novel MTH1 inhibitors. Chem Biol Drug Des89:862-869 (2017) 
 
Oxidized purine nucleoside triphosphate hydrolase
Name:Oxidized purine nucleoside triphosphate hydrolase
Type:Protein
Mol. Mass.:22514.81
Organism:Homo sapiens (Human)
Description:P36639
Residue:197
BDBM227638
BDBM227639
NameBDBM227638
Synonyms:MTH1 inhibitor, 132
TypeSmall organic molecule
Emp. Form.C15H20ClN5
Mol. Mass.305.806
SMILESCC12CC(CC(C)(C)C1)N(C2)c1nc(Cl)nc2[nH]cnc12