Reaction Details
TargetATP-dependent translocase ABCB1 bd-verapamil
LigandBDBM81939
Substrate/Competitorn/a
Meas. Tech.Fluorescence Correlation Spectroscopy (FCS)
Temperature295.65±0.5 K
IC50 1.73e+5± 6.9e+4 nM
Citation Li, MJNath, AAtkins, WM Differential Coupling of Binding, ATP Hydrolysis, and Transport of Fluorescent Probes with P-Glycoprotein in Lipid Nanodiscs. Biochemistry56:2506-2517 (2017) 
 
ATP-dependent translocase ABCB1 bd-verapamil
Name:ATP-dependent translocase ABCB1 bd-verapamil
Type:Protein
Mol. Mass.:n/a
Description:n/a
Components:This complex has 2 components.
Component 1
Name:ATP-dependent translocase ABCB1
Synonyms:Abcb1a MDR1A_MOUSE Mdr3 P-glycoprotein 1 and 3 (MDR1a/MDR1b) Pgy-3 | Pgy3
Type:Protein
Mol. Mass.:140669.02
Organism:Mus musculus (Mouse)
Description:P21447
Residue:1276
Component 2
NameBDBM227641
Synonyms:BD-verapamil | BODIPY-verapamil
TypeSmall organic molecule
Emp. Form.C41H55BF2N4O5
Mol. Mass.732.707
SMILESCOc1ccc(CCN(C)CCCC(CNC(=O)CCC2=[N+]3C(C=C2)=Cc2c(C)cc(C)n2[B-]3(F)F)(C(C)C)c2ccc(OC)c(OC)c2)cc1OC
BDBM81939
NameBDBM81939
Synonyms:CAS_52-53-9 VERAPAMIL
TypeSmall organic molecule
Emp. Form.C27H38N2O4
Mol. Mass.454.6016
SMILESCOc1ccc(CCN(C)CCCC(C#N)(C(C)C)c2ccc(OC)c(OC)c2)cc1OC