Reaction Details
TargetBeta-glucuronidase
LigandBDBM163637
Substrate/Competitorn/a
Meas. Tech.Activity Assay
IC50 369.3±2.51 nM
Citation Redinbo, MR Selective β-glucuronidase inhibitors as a treatment for side effects of camptothecin antineoplastic agents US Patent US9334288 Publication Date 5/10/2016
 
Beta-glucuronidase
Name:Beta-glucuronidase
Type:Protein
Mol. Mass.:74736.05
Organism:Homo sapiens (Human)
Description:n/a
Residue:651
BDBM163637
NameBDBM163637
Synonyms:3[(6,7Dimethyl2oxo1,2dihydroquinolin3yl)methyl]3(2hydroxyethyl)1(3 methoxyphenyl)thiourea (Inh 2) | US9334288, 4
TypeSmall organic molecule
Emp. Form.C22H25N3O3S
Mol. Mass.411.517
SMILESCOc1cccc(NC(=S)N(CCO)Cc2cc3cc(C)c(C)cc3[nH]c2=O)c1