Reaction Details
TargetBeta-glucuronidase
LigandBDBM163643
Substrate/Competitorn/a
Meas. Tech.Activity Assay
IC50 740.1±20.4 nM
Citation Redinbo, MR Selective β-glucuronidase inhibitors as a treatment for side effects of camptothecin antineoplastic agents US Patent US9334288 Publication Date 5/10/2016
 
Beta-glucuronidase
Name:Beta-glucuronidase
Type:Protein
Mol. Mass.:74736.05
Organism:Homo sapiens (Human)
Description:n/a
Residue:651
BDBM163643
NameBDBM163643
Synonyms:2[4(2H1,3benzodioxol5ylmethyl)piperazin1yl]N(2,5dimethoxycyclohexyl)acetamide (Inh 8) | US9334288, 8
TypeSmall organic molecule
Emp. Form.C22H33N3O5
Mol. Mass.419.5145
SMILESCOC1CCC(OC)C(C1)NC(=O)CN1CCN(Cc2ccc3OCOc3c2)CC1