Reaction Details
TargetBeta-glucuronidase
LigandBDBM163639
Substrate/Competitorn/a
Meas. Tech.Activity Assay
EC50 1322.8±1.15 nM
Citation Redinbo, MR Selective β-glucuronidase inhibitors as a treatment for side effects of camptothecin antineoplastic agents US Patent US9334288 Publication Date 5/10/2016
 
Beta-glucuronidase
Name:Beta-glucuronidase
Type:Protein
Mol. Mass.:74736.05
Organism:Homo sapiens (Human)
Description:n/a
Residue:651
BDBM163639
NameBDBM163639
Synonyms:Methyl 2({[(6ethyl2oxo1,2dihydroquinolin3yl)methyl](2 hydroxyethyl)carbamothioyl}amino)benzoate (Inh 4) | US9334288, 6
TypeSmall organic molecule
Emp. Form.C23H25N3O4S
Mol. Mass.439.527
SMILESCCc1ccc2[nH]c(=O)c(CN(CCO)C(=S)Nc3ccccc3C(=O)OC)cc2c1