Reaction Details
TargetBeta-glucuronidase
LigandBDBM163641
Substrate/Competitorn/a
Meas. Tech.Cell-Based Assay
EC50 913.3±20.4 nM
Citation Redinbo, MR Selective β-glucuronidase inhibitors as a treatment for side effects of camptothecin antineoplastic agents US Patent US9334288 Publication Date 5/10/2016
 
Beta-glucuronidase
Name:Beta-glucuronidase
Type:Protein
Mol. Mass.:74736.05
Organism:Homo sapiens (Human)
Description:n/a
Residue:651
BDBM163641
NameBDBM163641
Synonyms:1[2(3Fluorophenyl)5H,6H,7H,8Hpyrazolo[3,2b]quinazolin9yl]piperazine (Inh 6) | US9334288, 7
TypeSmall organic molecule
Emp. Form.C20H22FN5
Mol. Mass.351.4206
SMILESFc1cccc(c1)-c1cc2nc3CCCCc3c(N3CCNCC3)n2n1