Reaction Details
TargetMembrane-associated progesterone receptor component 1
LigandBDBM86690
Substrate/Competitorn/a
Ki 0.81±n/a nM
Citation Jacobson, PBvon Geldern, TWOhman, LOsterland, MWang, JZinker, BWilcox, DNguyen, PTMika, AFung, SFey, TGoos-Nilsson, AGrynfarb, MBarkhem, TMarsh, KBeno, DWNga-Nguyen, BKym, PRLink, JTTu, NEdgerton, DSCherrington, AEfendic, SLane, BCOpgenorth, TJ Hepatic glucocorticoid receptor antagonism is sufficient to reduce elevated hepatic glucose output and improve glucose control in animal models of type 2 diabetes. J Pharmacol Exp Ther314:191-200 (2005) 
 
Membrane-associated progesterone receptor component 1
Name:Membrane-associated progesterone receptor component 1
Type:Enzyme Catalytic Domain
Mol. Mass.:21581.66
Organism:RAT
Description:progesterone 0 RAT::P70580
Residue:195
BDBM86690
NameBDBM86690
Synonyms:A 348441 | A-348441
TypeSmall organic molecule
Emp. Form.C52H71NO7
Mol. Mass.822.1226
SMILESCC#C[C@]1(O)CC[C@H]2[C@@H]3CCC4=CC(=O)CCC4=C3[C@H](C[C@]12C)c1ccc(cc1)N(C)CCO[C@H]1CCC2C(C1)C[C@@H](O)C1C3CCC(C(C)CCC(O)=O)C3[C@@H](O)CC21