Reaction Details
TargetMembrane-associated progesterone receptor component 1
LigandBDBM86689
Substrate/Competitorn/a
Ki 0.64±n/a nM
Citation Jacobson, PBvon Geldern, TWOhman, LOsterland, MWang, JZinker, BWilcox, DNguyen, PTMika, AFung, SFey, TGoos-Nilsson, AGrynfarb, MBarkhem, TMarsh, KBeno, DWNga-Nguyen, BKym, PRLink, JTTu, NEdgerton, DSCherrington, AEfendic, SLane, BCOpgenorth, TJ Hepatic glucocorticoid receptor antagonism is sufficient to reduce elevated hepatic glucose output and improve glucose control in animal models of type 2 diabetes. J Pharmacol Exp Ther314:191-200 (2005) 
 
Membrane-associated progesterone receptor component 1
Name:Membrane-associated progesterone receptor component 1
Type:Enzyme Catalytic Domain
Mol. Mass.:21581.66
Organism:RAT
Description:progesterone 0 RAT::P70580
Residue:195
BDBM86689
NameBDBM86689
Synonyms:CAS_84371-65-3 RU-486
TypeSmall organic molecule
Emp. Form.C29H35NO2
Mol. Mass.429.5937
SMILESCC#CC1(O)CCC2C3CCC4=CC(=O)CCC4=C3C(CC12C)c1ccc(cc1)N(C)C