Reaction Details
TargetSerine/threonine-protein kinase receptor R3
LigandBDBM118134
Substrate/Competitorn/a
Meas. Tech.ALK1-6 enzymatic assays
pH7.5±n/a
IC50 27±n/a nM
Commentsextracted
Citation Alimardanov, ACuny, GDGrewal, GSLee, AMcKew, JCMohedas, AHShen, MXu, XYu, PB BMP inhibitors and methods of use thereof US Patent US9682983 Publication Date 6/20/2017
 
Serine/threonine-protein kinase receptor R3
Name:Serine/threonine-protein kinase receptor R3
Type:Enzyme
Mol. Mass.:56134.46
Organism:Homo sapiens (Human)
Description:P37023
Residue:503
BDBM118134
NameBDBM118134
Synonyms:US10017516, Compound 3 | US9682983, 3
TypeSmall organic molecule
Emp. Form.C24H21N7
Mol. Mass.407.4704
SMILESC1CN(CCN1)c1ccc(nc1)-c1cnc2c(cnn2c1)-c1ccnc2ccccc12