Reaction Details
TargetBone morphogenetic protein receptor type-1A
LigandBDBM143207
Substrate/Competitorn/a
Meas. Tech.ALK1-6 enzymatic assays
pH7.5±n/a
IC50 189±n/a nM
Commentsextracted
Citation Alimardanov, ACuny, GDGrewal, GSLee, AMcKew, JCMohedas, AHShen, MXu, XYu, PB BMP inhibitors and methods of use thereof US Patent US9682983 Publication Date 6/20/2017
 
Bone morphogenetic protein receptor type-1A
Name:Bone morphogenetic protein receptor type-1A
Type:Enzyme
Mol. Mass.:60204.46
Organism:Homo sapiens (Human)
Description:P36894
Residue:532
BDBM143207
NameBDBM143207
Synonyms:US10017516, Compound 7 | US9682983, 7
TypeSmall organic molecule
Emp. Form.C22H19N7S
Mol. Mass.413.498
SMILESC1CN(CCN1)c1cnc(s1)-c1cnc2c(cnn2c1)-c1ccnc2ccccc12