Reaction Details
TargetSerine/threonine-protein kinase receptor R3
LigandBDBM143246
Substrate/Competitorn/a
Meas. Tech.ALK1-6 enzymatic assays
pH7.5±n/a
IC50 22±n/a nM
Commentsextracted
Citation Alimardanov, ACuny, GDGrewal, GSLee, AMcKew, JCMohedas, AHShen, MXu, XYu, PB BMP inhibitors and methods of use thereof US Patent US9682983 Publication Date 6/20/2017
 
Serine/threonine-protein kinase receptor R3
Name:Serine/threonine-protein kinase receptor R3
Type:Enzyme
Mol. Mass.:56134.46
Organism:Homo sapiens (Human)
Description:P37023
Residue:503
BDBM143246
NameBDBM143246
Synonyms:US10017516, Compound 8 | US9682983, 8
TypeSmall organic molecule
Emp. Form.C25H21ClN6
Mol. Mass.440.927
SMILESClc1cc(-c2cnn3cc(cnc23)-c2ccc(cc2)N2CCNCC2)c2ccccc2n1