Reaction Details
TargetActivin receptor type-1B
LigandBDBM148353
Substrate/Competitorn/a
Meas. Tech.ALK1-6 enzymatic assays
pH7.5±n/a
IC50 818±n/a nM
Commentsextracted
Citation Alimardanov, ACuny, GDGrewal, GSLee, AMcKew, JCMohedas, AHShen, MXu, XYu, PB BMP inhibitors and methods of use thereof US Patent US9682983 Publication Date 6/20/2017
 
Activin receptor type-1B
Name:Activin receptor type-1B
Type:PROTEIN
Mol. Mass.:56810.99
Organism:Homo sapiens (Human)
Description:ChEMBL_587064
Residue:505
BDBM148353
NameBDBM148353
Synonyms:US10017516, Compound 24 | US9682983, 24
TypeSmall organic molecule
Emp. Form.C26H24N6O
Mol. Mass.436.5084
SMILESOCc1cccc2c(ccnc12)-c1cnn2cc(cnc12)-c1ccc(cc1)N1CCNCC1