Reaction Details
TargetBone morphogenetic protein receptor type-1A
LigandBDBM148356
Substrate/Competitorn/a
Meas. Tech.ALK1-6 enzymatic assays
pH7.5±n/a
IC50 153±n/a nM
Commentsextracted
Citation Alimardanov, ACuny, GDGrewal, GSLee, AMcKew, JCMohedas, AHShen, MXu, XYu, PB BMP inhibitors and methods of use thereof US Patent US9682983 Publication Date 6/20/2017
 
Bone morphogenetic protein receptor type-1A
Name:Bone morphogenetic protein receptor type-1A
Type:Enzyme
Mol. Mass.:60204.46
Organism:Homo sapiens (Human)
Description:P36894
Residue:532
BDBM148356
NameBDBM148356
Synonyms:US10017516, Compound 27 | US9682983, 27
TypeSmall organic molecule
Emp. Form.C25H23N7
Mol. Mass.421.497
SMILESNc1ccc2c(ccnc2c1)-c1cnn2cc(cnc12)-c1ccc(cc1)N1CCNCC1