Reaction Details
TargetActivin receptor type-1
LigandBDBM161910
Substrate/Competitorn/a
Meas. Tech.ALK1-6 enzymatic assays
pH7.5±n/a
IC50 14±n/a nM
Commentsextracted
Citation Alimardanov, ACuny, GDGrewal, GSLee, AMcKew, JCMohedas, AHShen, MXu, XYu, PB BMP inhibitors and methods of use thereof US Patent US9682983 Publication Date 6/20/2017
 
Activin receptor type-1
Name:Activin receptor type-1
Type:n/a
Mol. Mass.:57158.32
Organism:Homo sapiens (Human)
Description:n/a
Residue:509
BDBM161910
NameBDBM161910
Synonyms:US10017516, Compound 42 | US9682983, 42
TypeSmall organic molecule
Emp. Form.C26H25N7O
Mol. Mass.451.523
SMILESC(CN1CCNCC1)Oc1ccc(cn1)-c1cnc2c(cnn2c1)-c1cccc2ncccc12