Reaction Details
TargetActivin receptor type-1
LigandBDBM161914
Substrate/Competitorn/a
Meas. Tech.ALK1-6 enzymatic assays
pH7.5±n/a
IC50 16±n/a nM
Commentsextracted
Citation Alimardanov, ACuny, GDGrewal, GSLee, AMcKew, JCMohedas, AHShen, MXu, XYu, PB BMP inhibitors and methods of use thereof US Patent US9682983 Publication Date 6/20/2017
 
Activin receptor type-1
Name:Activin receptor type-1
Type:n/a
Mol. Mass.:57158.32
Organism:Homo sapiens (Human)
Description:n/a
Residue:509
BDBM161914
NameBDBM161914
Synonyms:US10017516, Compound 46 | US9682983, 46
TypeSmall organic molecule
Emp. Form.C28H26ClN5O
Mol. Mass.483.992
SMILESClc1cc(ccc1OCCN1CCCCC1)-c1cnc2c(cnn2c1)-c1cccc2ncccc12