Reaction Details
TargetBone morphogenetic protein receptor type-1A
LigandBDBM161924
Substrate/Competitorn/a
Meas. Tech.ALK1-6 enzymatic assays
pH7.5±n/a
IC50 2372±n/a nM
Commentsextracted
Citation Alimardanov, ACuny, GDGrewal, GSLee, AMcKew, JCMohedas, AHShen, MXu, XYu, PB BMP inhibitors and methods of use thereof US Patent US9682983 Publication Date 6/20/2017
 
Bone morphogenetic protein receptor type-1A
Name:Bone morphogenetic protein receptor type-1A
Type:Enzyme
Mol. Mass.:60204.46
Organism:Homo sapiens (Human)
Description:P36894
Residue:532
BDBM161924
NameBDBM161924
Synonyms:US10017516, Compound 56 | US9682983, 56
TypeSmall organic molecule
Emp. Form.C27H26N6O2
Mol. Mass.466.5343
SMILESCc1ccc2c(cccc2n1)-c1cnn2cc(cnc12)-c1ccc(OCCN2CCOCC2)cn1